{"text_format":"1","workbook":"xlsx","n_sheets":6,"sheets":["Simulador Rendimento Líquido","Configuração","Fiscalidade Ano N-1","Fiscalidade Ano N","Fiscalidade Ano N+1","Fiscalidade Ano 2019"],"not_rendered":{"charts":0,"images":3,"macros":1,"external_links":0,"defined_names":7,"comments":0,"pivot_tables":0},"unopened":[],"bounds":{"document_bytes":16777216,"sheet_cells":100000,"rows_first":2000,"rows_last":500,"rows_between":2000,"halvings":0,"cell_chars":16384,"cell_head_chars":4096},"cells_cut":0,"cells_raw":0,"read":"whole","date_system":"1900"}

{"sheet":"Simulador Rendimento Líquido","index":0,"n_rows":119,"n_cols":33,"rows_kept":119,"cut":false,"hidden":false,"merged":[[19,2,19,4],[20,2,20,3],[21,2,21,3],[34,27,34,28],[39,27,39,28],[45,27,45,28],[48,27,48,28],[62,27,62,28],[82,2,82,3],[39,18,39,20],[38,1,38,3],[39,2,39,3],[45,10,45,12],[48,10,48,12],[67,27,67,28],[76,27,76,28],[37,1,37,3],[34,25,34,26],[26,14,26,16],[30,14,30,16],[28,14,28,16],[45,5,45,7],[48,5,48,7],[26,2,26,3],[88,2,88,3],[51,5,51,7],[54,5,54,7],[51,10,51,12],[54,10,54,12],[51,14,51,16],[54,14,54,16],[51,18,51,20],[54,18,54,20],[62,5,62,7],[62,2,62,3],[76,2,76,3],[88,14,88,15],[88,18,88,19],[118,2,118,26],[106,1,106,3],[76,22,76,23],[67,22,67,23],[45,2,45,3],[39,22,39,23],[48,22,48,23],[45,22,45,23],[67,2,67,3],[61,1,61,3],[62,22,62,23],[67,10,67,12],[105,1,105,3],[104,1,104,3],[39,25,39,26],[45,25,45,26],[48,25,48,26],[62,25,62,26],[67,25,67,26],[76,25,76,26],[45,14,45,16],[48,14,48,16],[62,14,62,16],[67,14,67,16],[28,2,28,3],[48,2,48,3],[62,10,62,12],[67,5,67,7],[76,5,76,7],[76,10,76,12],[34,5,34,7],[30,2,30,3],[36,1,36,3],[39,10,39,12],[34,10,34,12],[51,2,51,3],[54,2,54,3],[58,2,58,3],[1,29,1,32],[6,2,6,3],[7,2,7,3],[8,2,8,3],[9,2,9,3],[5,14,5,16],[8,14,8,16],[9,14,9,16],[10,14,10,16],[7,14,7,16],[6,14,6,16],[5,1,5,3],[17,14,17,16],[12,14,12,16],[10,1,10,3],[24,1,24,3],[14,2,14,3],[17,2,17,3],[18,2,18,3],[12,2,12,3],[13,2,13,3],[24,14,24,16],[14,14,14,16],[18,14,18,16],[15,2,15,3],[15,14,15,16],[16,2,16,3],[16,14,16,16],[13,14,13,16],[11,2,11,3],[11,14,11,16],[19,14,19,16],[20,14,20,16],[21,14,21,16],[22,2,22,3],[23,2,23,3],[58,25,58,26],[58,27,58,28],[45,18,45,20],[48,18,48,20],[62,18,62,20],[67,18,67,20],[76,18,76,20],[39,5,39,7],[34,22,34,23],[34,14,34,16],[39,14,39,16],[34,18,34,20],[58,5,58,7],[58,10,58,12],[22,14,22,16],[23,14,23,16],[56,2,56,3],[56,5,56,7],[56,10,56,12],[56,14,56,16],[88,22,88,23],[88,24,88,25],[88,26,88,27],[51,27,51,28],[54,27,54,28],[82,14,82,15],[82,18,82,19],[82,22,82,23],[82,24,82,25],[82,26,82,27],[76,14,76,16],[56,18,56,20],[56,22,56,23],[56,25,56,26],[56,27,56,28],[58,14,58,16],[58,18,58,20],[58,22,58,23],[93,2,93,3],[93,14,93,15],[93,18,93,19],[93,22,93,23],[93,24,93,25],[93,26,93,27],[98,2,98,3],[98,14,98,15],[98,18,98,19],[98,22,98,23],[98,24,98,25],[98,26,98,27]]}
[]
[null,"Simulador Rendimento Líquido 2019 (PL OE 2019)",null,null,null,null,null,null,null,null,null,null,null,null,null,null,null,null,null,null,null,null,null,null,null,null,null,null,null,"Visibilidade"]
[null,null,null,null,null,null,null,null,null,null,null,null,null,null,null,null,null,null,null,null,null,null,null,null,null,null,null,null,null,{"$f":"Configuração!C11","v":"[ Seleccione Uma Opção ]"},{"$f":"Configuração!C12","v":"Trabalho Dependente - Privado"},{"$f":"Configuração!C13","v":"Trabalho Dependente - Função Pública"},{"$f":"Configuração!C14","v":"Pensionistas - Privado"}]
[null,"Para simular, por favor preencha no quadro abaixo nos campos a amarelo os seus dados",null,null,null,null,null,null,null,null,null,null,null,null,null,null,null,null,null,null,null,null,null,null,null,null,null,"Desenvolvido Por",null,"x","x","x","x"]
[null,null,null,null,null,null,null,{"$f":"VLOOKUP($O$8&$O$9, Configuração!$C$75:$D$95, 2, FALSE)","v":{"$error":"#N/A"}},null,null,null,null,null,null,null,null,null,null,{"$f":"S6+S11+S25","v":3},null,null,null,null,null,null,null,null,null,null,"x","x","x","x"]
[null,"Contexto",null,null,null,null,null,null,null,null,null,null,null,null,{"$f":"IF($S6>=4,\"Por seleccionar / preencher abaixo\",IF($S6>0,\"Selecção / preenchimento incorrecto\",\"Selecção / preenchimento correcto\"))","v":"Selecção / preenchimento incorrecto"},null,null,null,{"$f":"SUM(S7:S10)","v":2},null,null,null,null,null,null,null,null,null,null,"x","x","x","x"]
[null,null,"Região geográfica",null,null,null,null,null,null,null,null,null,null,null,"Continente",null,null,null,{"$f":"IF($O$7=Configuração!$C$6,1,0)","v":0},null,null,null,null,null,null,null,null,null,null,"x","x","x","x"]
[null,null,"Sector",null,null,null,null,null,null,null,null,null,null,null,"Trabalho Dependente - Privado",null,null,null,{"$f":"IF($O$8=Configuração!$C$11,1,0)","v":0},null,null,null,null,null,null,null,null,null,null,"x","x","x","x"]
[null,null,"Situação pessoal",null,null,null,null,null,null,null,null,null,null,null,null,null,null,null,{"$f":"IF(ISNA(VLOOKUP($O$8&$O$9, Configuração!$E$16:$E$40, 1, FALSE)), 1, 0)","v":1},null,null,null,null,null,null,null,null,null,null,"x","x","x","x"]
[null,null,"Número de dependentes",null,null,null,null,null,null,null,null,null,null,null,null,null,null,null,{"$f":"IF($O$8=Configuração!$C$14, 0, IF(ISNA(VLOOKUP($O$8&$O$10, Configuração!$E$42:$E$56, 1, FALSE)), 1, 0))","v":1},null,null,null,null,null,null,null,null,null,null,"x","x","x"]
[null,"Remuneração",null,null,null,null,null,null,null,null,null,null,null,null,{"$f":"IF($S11>=1,\"Por seleccionar / preencher abaixo\",IF($S11>0,\"Selecção / preenchimento incorrecto\",\"Selecção / preenchimento correcto\"))","v":"Por seleccionar / preencher abaixo"},null,null,null,{"$f":"SUM(S13:S19)","v":1},null,null,null,null,null,null,null,null,null,null,"x","x","x","x"]
[null,null,"Mês da remuneração",null,null,null,null,null,null,null,null,null,null,null,{"$f":"O13","v":0},null,null,null,{"$f":"IF(ISNA(VLOOKUP($O$8&$O$13, Configuração!$E$58:$E$69, 1, FALSE)), 1, 0)","v":1},null,null,null,null,null,null,null,null,null,null,"x","x","x","x"]
[null,null,"Tipo de mês da remuneração",null,null,null,null,null,null,null,null,null,null,null,null,null,null,null,{"$f":"IF(ISNA(VLOOKUP($O$8&$O$13, Configuração!$E$58:$E$69, 1, FALSE)), 1, 0)","v":1},null,null,null,null,null,null,null,null,null,null,"x","x","x","x"]
[null,null,"Momento do Pagamento",null,null,null,null,null,null,null,null,null,null,null,"Dezembro",null,null,null,null,null,null,null,null,null,null,null,null,null,null,"x","x","x","x"]
[null,null,{"$f":"IF($O$8=Configuração!$C$14, \"Pensão bruta\", \"Remuneração base bruta\")","v":"Remuneração base bruta"},null,null,null,null,null,null,null,null,null,null,null,null,null,null,null,null,null,null,null,null,null,null,null,null,null,null,"x","x","x","x"]
[null,null,"Remuneração bruta após corte 2016 (aplicavél à função pública)",null,null,null,null,null,null,null,null,null,null,null,{"$f":"IF(AND(O15>=Configuração!$B$104,O15-VLOOKUP(O15,Configuração!$B$102:$J$105,2,1)*O15<=Configuração!$B$104),Configuração!$B$104+(O15-Configuração!$B$104)*(Configuração!$I$101),O15-VLOOKUP(O15,Configuração!$B$102:$J$105,8,1))","v":0},null,null,null,null,null,null,null,null,null,null,null,null,null,null,"x","x","x"]
[null,null,"Remuneração bruta após corte 2017 (aplicavél à função pública)",null,null,null,null,null,null,null,null,null,null,null,{"$f":"O15","v":0},null,null,null,null,null,null,null,null,null,null,null,null,null,null,"x","x","x"]
[null,null,"Outros itens remuneratórios (sujeitos a Segurança Social, e.g. prémio regular)",null,null,null,null,null,null,null,null,null,null,null,null,null,null,null,null,null,null,null,null,null,null,null,null,null,null,"x","x","x"]
[null,null,"Outros itens remuneratórios (não sujeitos a Segurança Social, e.g. gratificação extraordinária)",null,null,null,null,null,null,null,null,null,null,null,null,null,null,null,null,null,null,null,null,null,null,null,null,null,null,"x","x","x"]
[null,null,"Montante de rendimento de anos anteriores (excluindo Subsídio de Férias e de Natal)"]
[null,null,"Número de meses a que o rendimento acima diz respeito"]
[null,null,"Montante auferido a título de Trabalho Suplementar"]
[null,null,"Montante auferido relativo a Subsídio de Natal do ano anterior"]
[null,null,"Montante auferido relativo a Subsídio de Férias do ano anterior"]
[null,"Subsídio de Refeição",null,null,null,null,null,null,null,null,null,null,null,null,{"$f":"IF($S25>=1,\"Por seleccionar / preencher abaixo\",IF($S25>0,\"Selecção / preenchimento incorrecto\",\"Selecção / preenchimento correcto\"))","v":"Selecção / preenchimento correcto"},null,null,null,{"$f":"SUM(S27:S31)","v":0},null,null,null,null,null,null,null,null,null,null,"x","x","x"]
[null,null,null,null,null,null,null,null,null,null,null,null,null,null,null,null,null,null,null,null,null,null,null,null,null,null,null,null,null,"x","x","x"]
[null,null,"Forma de atribuição de subsídio de refeição",null,null,null,null,null,null,null,null,null,null,null,null,null,null,null,{"$f":"IF($O$8=Configuração!$C$14, 0, IF($O$27=Configuração!$C$71, 1, 0))","v":0},null,null,null,null,null,null,null,null,null,null,"x","x","x"]
[null,null,null,null,null,null,null,null,null,null,null,null,null,null,null,null,null,null,null,null,null,null,null,null,null,null,null,null,null,"x","x","x"]
[null,null,"Valor diário do subsídio de refeição"]
[]
[null,null,"Número de dias úteis mensais"]
[]
[null,"Resultado da simulação"]
[]
[null,null,null,null,null,2016,null,null,null,null,2017,null,null,null,2018,null,null,null,2019,null,null,null,"Variação 2017 - 2016",null,null,"Variação 2018 - 2017",null,"Variação 2019 - 2018",null,null,"x"]
[null,null,null,null,null,null,null,null,null,null,null,null,null,null,null,null,null,null,null,null,null,null,null,null,null,null,null,null,null,null,"x"]
[null,"Simulador",null,null,null,"Remuneração \nSem Duodécimos","Remuneração \nCom Duodécimos","Taxas\nAplicadas",null,null,"Remuneração \nSem Duodécimos","Remuneração \nCom Duodécimos","Taxas\nAplicadas",null,"Remuneração \nSem Duodécimos","Remuneração \nCom Duodécimos","Taxas\nAplicadas",null,"Remuneração \nSem Duodécimos","Remuneração \nCom Duodécimos","Taxas\nAplicadas",null,"Remuneração \nSem Duodécimos","Remuneração \nCom Duodécimos",null,"Remuneração \nSem Duodécimos","Remuneração \nCom Duodécimos","Remuneração \nSem Duodécimos","Remuneração \nCom Duodécimos",null,"x"]
[null,"Rendimento Líquido",null,null,null,{"$f":"IF(OR($O$8=Configuração!$C$14, $S$5>0), \"\", F$39-F$62)","v":""},{"$f":"IF(OR($O$8=Configuração!$C$14, $S$5>0), \"\", G$39-G$62)","v":""},null,null,null,{"$f":"IF(OR($O$8=Configuração!$C$14, $S$5>0), \"\", K$39-K$62)","v":""},{"$f":"IF(OR($O$8=Configuração!$C$14, $S$5>0), \"\", L$39-L$62)","v":""},null,null,{"$f":"IF(OR($O$8=Configuração!$C$14, $S$5>0), \"\", O$39-O$62)","v":""},{"$f":"IF(OR($O$8=Configuração!$C$14, $S$5>0), \"\", P$39-P$62)","v":""},null,null,{"$f":"IF(OR($O$8=Configuração!$C$14, $S$5>0), \"\", S$39-S$62)","v":""},{"$f":"IF(OR($O$8=Configuração!$C$14, $S$5>0), \"\", T$39-T$62)","v":""},null,null,{"$f":"IFERROR(K38-F38, \"\")","v":""},{"$f":"IFERROR(L38-G38, \"\")","v":""},null,{"$f":"IFERROR(O38-K38, \"\")","v":""},{"$f":"IFERROR(P38-L38, \"\")","v":""},{"$f":"IFERROR(S38-O38, \"\")","v":""},{"$f":"IFERROR(T38-P38, \"\")","v":""},null,"x"]
[null,"Abonos",null,null,null,{"$f":"IF(OR($O$8=Configuração!$C$14, $S$5>0), \"\", SUM(F41:F45)+SUM(F47:F48)+SUM(F50:F50))","v":""},{"$f":"IF(OR($O$8=Configuração!$C$14, $S$5>0), \"\", SUM(G41:G45)+SUM(G47:G48)+SUM(G50:G50))","v":""},null,{"$f":"IF($S$5>0, \"\", SUM(I41:I45))","v":""},null,{"$f":"IF(OR($O$8=Configuração!$C$14, $S$5>0), \"\", SUM(K41:K45)+SUM(K47:K48)+SUM(K50:K50))","v":""},{"$f":"IF(OR($O$8=Configuração!$C$14, $S$5>0), \"\", SUM(L41:L45)+SUM(L47:L48)+SUM(L50:L50))","v":""},null,null,{"$f":"IF(OR($O$8=Configuração!$C$14, $S$5>0), \"\", SUM(O41:O45)+SUM(O47:O48)+SUM(O50:O50)+$O$53+$O$56+$O$58+O60)","v":""},{"$f":"IF(OR($O$8=Configuração!$C$14, $S$5>0), \"\", SUM(P41:P45)+SUM(P47:P48)+SUM(P50:P50)+$P$53+$P$56+$P$58+$P$60)","v":""},null,null,{"$f":"IF(OR($O$8=Configuração!$C$14, $S$5>0), \"\", SUM(S41:S45)+SUM(S47:S48)+SUM(S50:S50)+S$53+S$56+$S$58+$S$60)","v":""},{"$f":"IF(OR($O$8=Configuração!$C$14, $S$5>0), \"\", SUM(T41:T45)+SUM(T47:T48)+SUM(T50:T50)+T$53+T$56+$T$58+$T$60)","v":""},null,null,{"$f":"IFERROR(K39-F39, \"\")","v":""},{"$f":"IFERROR(L39-G39, \"\")","v":""},null,{"$f":"IFERROR(O39-K39, \"\")","v":""},{"$f":"IFERROR(P39-L39, \"\")","v":""},{"$f":"IFERROR(S39-O39, \"\")","v":""},{"$f":"IFERROR(T39-P39, \"\")","v":""},null,"x"]
[null,null,"Remuneração sem Subsídios",null,null,null,null,null,null,null,null,null,null,null,null,null,null,null,null,null,null,null,null,null,null,null,null,null,null,null,"x"]
{"$rows_left_out":80}
{"sheet":"Configuração","index":1,"n_rows":105,"n_cols":10,"rows_kept":105,"cut":false,"hidden":true,"merged":[]}
[]
[null,"Simulador Rendimento Líquido em 2018"]
[]
[null,"Configuração de parâmetros",null,null,null,"Desenvolvido por"]
[]
[null,"Região Geográfica","[ Seleccione Uma Opção ]"]
[null,"Região Geográfica","Continente"]
[null,"Região Geográfica","Região Autónoma dos Açores"]
[null,"Região Geográfica","Região Autónoma da Madeira"]
[]
[null,"Sector","[ Seleccione Uma Opção ]"]
[null,"Sector","Trabalho Dependente - Privado"]
[null,"Sector","Trabalho Dependente - Função Pública"]
[null,"Sector","Pensionistas - Privado"]
[]
[null,"Situação pessoal","[ Seleccione Uma Opção ]","[ Seleccione Uma Opção ]"]
[null,"Situação pessoal",{"$f":"$C$12","v":"Trabalho Dependente - Privado"},"[ Seleccione Uma Opção ]"]
[null,"Situação pessoal",{"$f":"$C$12","v":"Trabalho Dependente - Privado"},"Não Casado",{"$f":"C18&D18","v":"Trabalho Dependente - PrivadoNão Casado"}]
[null,"Situação pessoal","Trabalho Dependente - Privado","Casado (Um Titular)","Trabalho Dependente - PrivadoCasado (Um Titular)"]
[null,"Situação pessoal","Trabalho Dependente - Privado","Casado (Dois Titulares)","Trabalho Dependente - PrivadoCasado (Dois Titulares)"]
[null,"Situação pessoal","Trabalho Dependente - Privado","Deficiente - Não Casado","Trabalho Dependente - PrivadoDeficiente - Não Casado"]
[null,"Situação pessoal","Trabalho Dependente - Privado","Deficiente - Casado (Um Titular)","Trabalho Dependente - PrivadoDeficiente - Casado (Um Titular)"]
[null,"Situação pessoal","Trabalho Dependente - Privado","Deficiente - Casado (Dois Titulares)","Trabalho Dependente - PrivadoDeficiente - Casado (Dois Titulares)"]
[null,"Situação pessoal",{"$f":"$C$13","v":"Trabalho Dependente - Função Pública"},"[ Seleccione Uma Opção ]"]
[null,"Situação pessoal",{"$f":"$C$13","v":"Trabalho Dependente - Função Pública"},"Não Casado","Trabalho Dependente - Função PúblicaNão Casado"]
[null,"Situação pessoal","Trabalho Dependente - Função Pública","Casado (Um Titular)","Trabalho Dependente - Função PúblicaCasado (Um Titular)"]
[null,"Situação pessoal","Trabalho Dependente - Função Pública","Casado (Dois Titulares)","Trabalho Dependente - Função PúblicaCasado (Dois Titulares)"]
[null,"Situação pessoal","Trabalho Dependente - Função Pública","Deficiente - Não Casado","Trabalho Dependente - Função PúblicaDeficiente - Não Casado"]
[null,"Situação pessoal","Trabalho Dependente - Função Pública","Deficiente - Casado (Um Titular)","Trabalho Dependente - Função PúblicaDeficiente - Casado (Um Titular)"]
[null,"Situação pessoal","Trabalho Dependente - Função Pública","Deficiente - Casado (Dois Titulares)","Trabalho Dependente - Função PúblicaDeficiente - Casado (Dois Titulares)"]
[null,"Situação pessoal",{"$f":"$C$14","v":"Pensionistas - Privado"},"[ Seleccione Uma Opção ]"]
[null,"Situação pessoal",{"$f":"$C$14","v":"Pensionistas - Privado"},"Não Casado","Pensionistas - PrivadoNão Casado"]
[null,"Situação pessoal","Pensionistas - Privado","Casado (Um Titular)","Pensionistas - PrivadoCasado (Um Titular)"]
[null,"Situação pessoal","Pensionistas - Privado","Casado (Dois Titulares)","Pensionistas - PrivadoCasado (Dois Titulares)"]
[null,"Situação pessoal","Pensionistas - Privado","Deficiente - Não Casado","Pensionistas - PrivadoDeficiente - Não Casado"]
[null,"Situação pessoal","Pensionistas - Privado","Deficiente - Casado (Um Titular)","Pensionistas - PrivadoDeficiente - Casado (Um Titular)"]
[null,"Situação pessoal","Pensionistas - Privado","Deficiente - Casado (Dois Titulares)","Pensionistas - PrivadoDeficiente - Casado (Dois Titulares)"]
[null,"Situação pessoal","Pensionistas - Privado","Deficiente Forças Armadas - Não Casado","Pensionistas - PrivadoDeficiente Forças Armadas - Não Casado"]
[null,"Situação pessoal","Pensionistas - Privado","Deficiente Forças Armadas - Casado (Um Titular)","Pensionistas - PrivadoDeficiente Forças Armadas - Casado (Um Titular)"]
[null,"Situação pessoal","Pensionistas - Privado","Deficiente Forças Armadas - Casado (Dois Titulares)","Pensionistas - PrivadoDeficiente Forças Armadas - Casado (Dois Titulares)"]
{"$rows_left_out":66}
{"sheet":"Fiscalidade Ano N-1","index":2,"n_rows":509,"n_cols":11,"rows_kept":509,"cut":false,"hidden":true,"merged":[[5,1,5,4],[35,5,35,10],[15,1,15,4],[10,1,10,4],[7,3,7,4],[12,3,12,4],[13,3,13,4],[35,3,35,4],[7,1,7,2],[12,1,12,2],[13,1,13,2],[17,1,17,2],[18,1,18,2],[22,1,22,2],[22,3,22,6],[8,3,8,4]]}
[]
[null,"Simulador Rendimento Líquido em 2016"]
[]
[null,"Enquadramento Fiscal Ano N (2016)",null,null,null,null,null,null,"Desenvolvido por"]
[]
[null,"Enquadramento Fiscal - Segurança Social"]
[]
[null,"Taxa Social Única",null,0.11]
[null,"ADSE",null,3.5000000000000003E-2]
[]
[null,"Enquadramento Fiscal - Sobretaxa IRS"]
[]
[null,"Taxa Sobretaxa IRS",null,3.5000000000000003E-2]
[null,"Limite Isenção Sobretaxa IRS (Retribuição Mínima Garantida)",null,530]
[]
[null,"Enquadramento Fiscal - Sobretaxa IRS"]
[]
[null,"Limite Isenção Subsídio de Refeição",null,"Numerário",4.2699999999999996]
[null,"Limite Isenção Subsídio de Refeição",null,"Vale de Refeição",6.83]
[]
[null,"Sobretaxa"]
[]
[null,"Tabela aplicável a sujeitos passivos não casados e casados 2 titulares",null,"Tabela aplicável a sujeitos passivos casados (1 titular)"]
[null,"Limite inferior","Taxa","Limite inferior","Taxa"]
[null,0,0,0,0]
[null,801,0.01,1205,0.01]
[null,1683,1.7500000000000002E-2,2888,1.7500000000000002E-2]
[null,3054,0.03,6280,0.03]
[null,5786,3.5000000000000003E-2,10282,3.5000000000000003E-2]
[null,null,0]
[]
[]
[]
[null,"Tabelas Retenção Fonte"]
[]
[null,null,null,"Remuneração Mensal ",null,"Número Dependentes"]
[null,"Região Geográfica","Tabela Retenção Fonte","De","Até",0,1,2,3,4,"5 ou Mais"]
[null,"Continente","TABELA I - TRABALHO DEPENDENTE - NÃO CASADO",{"$f":"IF(ISNUMBER(E37), E37, 0)","v":0},610,0,0,0,0,0,0]
[null,"Continente","TABELA I - TRABALHO DEPENDENTE - NÃO CASADO",{"$f":"IF(ISNUMBER(E38), E38, 0)","v":610},618,1.7999999999999999E-2,0,0,0,0,0]
[null,"Continente","TABELA I - TRABALHO DEPENDENTE - NÃO CASADO",618,640,0.05,0,0,0,0,0]
{"$rows_left_out":470}
{"sheet":"Fiscalidade Ano N","index":3,"n_rows":509,"n_cols":13,"rows_kept":509,"cut":false,"hidden":true,"merged":[[5,1,5,4],[7,1,7,2],[7,3,7,4],[10,1,10,4],[12,1,12,2],[12,3,12,4],[8,3,8,4],[22,5,22,8],[22,1,22,4],[35,5,35,10],[13,1,13,2],[13,3,13,4],[15,1,15,4],[17,1,17,2],[18,1,18,2],[35,3,35,4],[29,1,29,2],[30,1,30,2],[31,1,31,2]]}
[]
[null,"Simulador Rendimento Líquido em 2017"]
[]
[null,"Enquadramento Fiscal Ano N-1 (2017)",null,null,null,null,null,null,"Desenvolvido por"]
[]
[null,"Enquadramento Fiscal - Segurança Social"]
[]
[null,"Taxa Social Única",null,0.11,null,"não consideramos a redução da TSU"]
[null,"ADSE",null,3.5000000000000003E-2]
[]
[null,"Enquadramento Fiscal - Sobretaxa IRS"]
[]
[null,"Taxa Sobretaxa IRS",null,0]
[null,"Limite Isenção Sobretaxa IRS (Retribuição Mínima Garantida)",null,557]
[]
[null,"Enquadramento Fiscal - Sobretaxa IRS"]
[]
[null,"Limite Isenção Subsídio de Refeição",null,"Numerário",4.5199999999999996]
[null,"Limite Isenção Subsídio de Refeição",null,"Vale de Refeição",7.23]
[]
[null,"Sobretaxa"]
[]
[null,"Tabela aplicável a sujeitos passivos não casados e casados 2 titulares",null,null,null,"Tabela aplicável a sujeitos passivos casados (1 titular)"]
[null,"Limite inferior",42916,43069,43100,"Limite inferior",42916,43069,43100,null,null,null,"Dezembro"]
[null,0,0,0,0,0,0,0,0,null,null,null,0]
[null,1705.01,1.7500000000000002E-2,0,0,2925.01,1.7500000000000002E-2,0,0,null,null,null,0]
[null,3094.01,0.03,0.03,0,6361.01,0.03,0.03,0,null,null,null,0]
[null,5862.01,3.5000000000000003E-2,3.5000000000000003E-2,0,10416.01,3.5000000000000003E-2,3.5000000000000003E-2,0,null,null,null,0]
[null,null,null,null,null,null,null,null,null,null,null,null,0]
[]
[]
[]
[]
[null,"Tabelas Retenção Fonte"]
[]
[null,null,null,"Remuneração Mensal ",null,"Número Dependentes"]
[null,"Região Geográfica","Tabela Retenção Fonte","De","Até",0,1,2,3,4,"5 ou Mais"]
[null,"Continente","TABELA I - TRABALHO DEPENDENTE - NÃO CASADO",{"$f":"IF(ISNUMBER(E37), E37, 0)","v":0},615,0,0,0,0,0,0]
[null,"Continente","TABELA I - TRABALHO DEPENDENTE - NÃO CASADO",{"$f":"IF(ISNUMBER(E38), E38, 0)","v":615},623,1.7999999999999999E-2,0,0,0,0,0]
[null,"Continente","TABELA I - TRABALHO DEPENDENTE - NÃO CASADO",623,645,0.05,0,0,0,0,0]
{"$rows_left_out":470}
{"sheet":"Fiscalidade Ano N+1","index":4,"n_rows":507,"n_cols":13,"rows_kept":507,"cut":false,"hidden":true,"merged":[[12,1,12,2],[12,3,12,4],[5,1,5,4],[7,1,7,2],[7,3,7,4],[8,3,8,4],[10,1,10,4],[13,1,13,2],[13,3,13,4],[15,1,15,4],[17,1,17,2],[18,1,18,2],[22,5,22,8],[29,1,29,2],[30,1,30,2],[31,1,31,2],[35,3,35,4],[35,5,35,10],[22,1,22,4]]}
[]
[null,"Simulador Rendimento Líquido em 2018"]
[]
[null,"Enquadramento Fiscal Ano N (2018)",null,null,null,null,null,null,"Desenvolvido por"]
[]
[null,"Enquadramento Fiscal - Segurança Social"]
[]
[null,"Taxa Social Única",null,0.11,null,"não consideramos a redução da TSU"]
[null,"ADSE",null,3.5000000000000003E-2]
[]
[null,"Enquadramento Fiscal - Sobretaxa IRS"]
[]
[null,"Taxa Sobretaxa IRS",null,0]
[null,"Limite Isenção Sobretaxa IRS (Retribuição Mínima Garantida)",null,580]
[]
[null,"Enquadramento Fiscal - Sobretaxa IRS"]
[]
[null,"Limite Isenção Subsídio de Refeição",null,"Numerário",4.7699999999999996]
[null,"Limite Isenção Subsídio de Refeição",null,"Vale de Refeição",7.63]
[]
[null,"Sobretaxa"]
[]
[null,"Tabela aplicável a sujeitos passivos não casados e casados 2 titulares",null,null,null,"Tabela aplicável a sujeitos passivos casados (1 titular)"]
[null,"Limite inferior",42916,43069,43100,"Limite inferior",42916,43069,43100,null,null,null,"Dezembro"]
[null,0,0,0,0,0,0,0,0,null,null,null,0]
[null,1705.01,1.7500000000000002E-2,0,0,2925.01,1.7500000000000002E-2,0,0,null,null,null,0]
[null,3094.01,0.03,0.03,0,6361.01,0.03,0.03,0,null,null,null,0]
[null,5862.01,3.5000000000000003E-2,3.5000000000000003E-2,0,10416.01,3.5000000000000003E-2,3.5000000000000003E-2,0,null,null,null,0]
[null,null,null,null,null,null,null,null,null,null,null,null,0]
[]
[]
[]
[]
[null,"Tabelas Retenção Fonte"]
[]
[null,null,null,"Remuneração Mensal ",null,"Número Dependentes"]
[null,"Região Geográfica","Tabela Retenção Fonte","De","Até",0,1,2,3,4,"5 ou Mais"]
[null,"Continente","TABELA I - TRABALHO DEPENDENTE - NÃO CASADO",{"$f":"IF(ISNUMBER(E37), E37, 0)","v":0},632,0,0,0,0,0,0]
[null,"Continente","TABELA I - TRABALHO DEPENDENTE - NÃO CASADO",{"$f":"IF(ISNUMBER(E38), E38, 0)","v":632},645,0.03,0,0,0,0,0]
[null,"Continente","TABELA I - TRABALHO DEPENDENTE - NÃO CASADO",645,683,5.7000000000000002E-2,1.2999999999999999E-2,0,0,0,0]
{"$rows_left_out":468}
{"sheet":"Fiscalidade Ano 2019","index":5,"n_rows":507,"n_cols":13,"rows_kept":507,"cut":false,"hidden":true,"merged":[[22,5,22,8],[29,1,29,2],[30,1,30,2],[31,1,31,2],[35,3,35,4],[35,5,35,10],[22,1,22,4],[13,1,13,2],[13,3,13,4],[15,1,15,4],[17,1,17,2],[18,1,18,2],[12,1,12,2],[12,3,12,4],[5,1,5,4],[7,1,7,2],[7,3,7,4],[8,3,8,4],[10,1,10,4]]}
[]
[null,"Simulador Rendimento Líquido em 2019"]
[]
[null,"Enquadramento Fiscal Ano N (2019)",null,null,null,null,null,null,"Desenvolvido por"]
[]
[null,"Enquadramento Fiscal - Segurança Social"]
[]
[null,"Taxa Social Única",null,0.11,null,"não consideramos a redução da TSU"]
[null,"ADSE",null,3.5000000000000003E-2]
[]
[null,"Enquadramento Fiscal - Sobretaxa IRS"]
[]
[null,"Taxa Sobretaxa IRS",null,0]
[null,"Limite Isenção Sobretaxa IRS (Retribuição Mínima Garantida)",null,580]
[]
[null,"Enquadramento Fiscal - Sobretaxa IRS"]
[]
[null,"Limite Isenção Subsídio de Refeição",null,"Numerário",4.7699999999999996]
[null,"Limite Isenção Subsídio de Refeição",null,"Vale de Refeição",7.63]
[]
[null,"Sobretaxa"]
[]
[null,"Tabela aplicável a sujeitos passivos não casados e casados 2 titulares",null,null,null,"Tabela aplicável a sujeitos passivos casados (1 titular)"]
[null,"Limite inferior",42916,43069,43100,"Limite inferior",42916,43069,43100,null,null,null,"Dezembro"]
[null,0,0,0,0,0,0,0,0,null,null,null,0]
[null,1705.01,1.7500000000000002E-2,0,0,2925.01,1.7500000000000002E-2,0,0,null,null,null,0]
[null,3094.01,0.03,0.03,0,6361.01,0.03,0.03,0,null,null,null,0]
[null,5862.01,3.5000000000000003E-2,3.5000000000000003E-2,0,10416.01,3.5000000000000003E-2,3.5000000000000003E-2,0,null,null,null,0]
[null,null,null,null,null,null,null,null,null,null,null,null,0]
[]
[]
[]
[]
[null,"Tabelas Retenção Fonte"]
[]
[null,null,null,"Remuneração Mensal ",null,"Número Dependentes"]
[null,"Região Geográfica","Tabela Retenção Fonte","De","Até",0,1,2,3,4,"5 ou Mais"]
[null,"Continente","TABELA I - TRABALHO DEPENDENTE - NÃO CASADO",{"$f":"IF(ISNUMBER(E37), E37, 0)","v":0},632,0,0,0,0,0,0]
[null,"Continente","TABELA I - TRABALHO DEPENDENTE - NÃO CASADO",{"$f":"IF(ISNUMBER(E38), E38, 0)","v":632},645,0.03,0,0,0,0,0]
[null,"Continente","TABELA I - TRABALHO DEPENDENTE - NÃO CASADO",645,683,5.7000000000000002E-2,1.2999999999999999E-2,0,0,0,0]
{"$rows_left_out":467}