{"text_format":"1","workbook":"xlsx","n_sheets":5,"sheets":["Simulador Rendimento Líquido","Configuração","Fiscalidade Ano N-1","Fiscalidade Ano N","Fiscalidade Ano N+1"],"not_rendered":{"charts":0,"images":3,"macros":1,"external_links":0,"defined_names":6,"comments":0,"pivot_tables":0},"unopened":[],"bounds":{"document_bytes":16777216,"sheet_cells":100000,"rows_first":2000,"rows_last":500,"rows_between":2000,"halvings":0,"cell_chars":16384,"cell_head_chars":4096},"cells_cut":0,"cells_raw":0,"read":"whole","date_system":"1900"}

{"sheet":"Simulador Rendimento Líquido","index":0,"n_rows":79,"n_cols":30,"rows_kept":79,"cut":false,"hidden":false,"merged":[[78,2,78,23],[68,1,68,3],[11,2,11,3],[11,10,11,12],[61,19,61,20],[52,19,52,20],[40,2,40,3],[34,19,34,20],[43,19,43,20],[40,19,40,20],[52,2,52,3],[46,1,46,3],[47,19,47,20],[52,10,52,12],[61,5,61,7],[61,10,61,12],[43,2,43,3],[29,19,29,20],[29,5,29,7],[25,2,25,3],[31,1,31,3],[34,10,34,12],[29,10,29,12],[29,15,29,17],[34,15,34,17],[67,1,67,3],[32,1,32,3],[21,10,21,12],[25,10,25,12],[23,10,23,12],[40,5,40,7],[43,5,43,7],[47,5,47,7],[47,2,47,3],[61,2,61,3],[21,2,21,3],[23,2,23,3],[17,2,17,3],[18,2,18,3],[12,2,12,3],[47,10,47,12],[52,5,52,7],[34,2,34,3],[40,10,40,12],[43,10,43,12],[13,2,13,3],[15,2,15,3],[15,10,15,12],[16,2,16,3],[16,10,16,12],[13,10,13,12],[1,26,1,29],[6,2,6,3],[7,2,7,3],[8,2,8,3],[9,2,9,3],[5,10,5,12],[8,10,8,12],[9,10,9,12],[10,10,10,12],[7,10,7,12],[6,10,6,12],[5,1,5,3],[19,10,19,12],[34,5,34,7],[66,1,66,3],[14,10,14,12],[18,10,18,12],[17,10,17,12],[12,10,12,12],[10,1,10,3],[19,1,19,3],[33,1,33,3],[14,2,14,3],[52,22,52,23],[61,22,61,23],[40,15,40,17],[43,15,43,17],[47,15,47,17],[52,15,52,17],[61,15,61,17],[29,22,29,23],[34,22,34,23],[40,22,40,23],[43,22,43,23],[47,22,47,23]]}
[]
[null,"Simulador Rendimento Líquido em 2018",null,null,null,null,null,null,null,null,null,null,null,null,null,null,null,null,null,null,null,null,null,null,null,null,"Visibilidade"]
[null,null,null,null,null,null,null,null,null,null,null,null,null,null,null,null,null,null,null,null,null,null,null,null,null,null,{"$f":"Configuração!C11","v":"[ Seleccione Uma Opção ]"},{"$f":"Configuração!C12","v":"Trabalho Dependente - Privado"},{"$f":"Configuração!C13","v":"Trabalho Dependente - Função Pública"},{"$f":"Configuração!C14","v":"Pensionistas - Privado"}]
[null,"Para simular, por favor preencha no quadro abaixo nos campos a amarelo os seus dados",null,null,null,null,null,null,null,null,null,null,null,null,null,null,null,null,null,null,null,null,"Desenvolvido Por",null,null,null,"x","x","x","x"]
[null,null,null,null,null,null,null,{"$f":"VLOOKUP($K$8&$K$9, Configuração!$C$75:$D$95, 2, FALSE)","v":{"$error":"#N/A"}},null,null,null,null,null,null,null,{"$f":"P6+P11+P20","v":3},null,null,null,null,null,null,null,null,null,null,"x","x","x","x"]
[null,"Contexto",null,null,null,null,null,null,null,null,{"$f":"IF($P6>=4,\"Por seleccionar / preencher abaixo\",IF($P6>0,\"Selecção / preenchimento incorrecto\",\"Selecção / preenchimento correcto\"))","v":"Selecção / preenchimento incorrecto"},null,null,null,null,{"$f":"SUM(P7:P10)","v":2},null,null,null,null,null,null,null,null,null,null,"x","x","x","x"]
[null,null,"Região geográfica",null,null,null,null,null,null,null,"Continente",null,null,null,null,{"$f":"IF($K$7=Configuração!$C$6,1,0)","v":0},null,null,null,null,null,null,null,null,null,null,"x","x","x","x"]
[null,null,"Sector",null,null,null,null,null,null,null,"Trabalho Dependente - Privado",null,null,null,null,{"$f":"IF($K$8=Configuração!$C$11,1,0)","v":0},null,null,null,null,null,null,null,null,null,null,"x","x","x","x"]
[null,null,"Situação pessoal",null,null,null,null,null,null,null,null,null,null,null,null,{"$f":"IF(ISNA(VLOOKUP($K$8&$K$9, Configuração!$E$16:$E$40, 1, FALSE)), 1, 0)","v":1},null,null,null,null,null,null,null,null,null,null,"x","x","x","x"]
[null,null,"Número de dependentes",null,null,null,null,null,null,null,null,null,null,null,null,{"$f":"IF($K$8=Configuração!$C$14, 0, IF(ISNA(VLOOKUP($K$8&$K$10, Configuração!$E$42:$E$56, 1, FALSE)), 1, 0))","v":1},null,null,null,null,null,null,null,null,null,null,"x","x","x"]
[null,"Remuneração",null,null,null,null,null,null,null,null,{"$f":"IF($P11>=1,\"Por seleccionar / preencher abaixo\",IF($P11>0,\"Selecção / preenchimento incorrecto\",\"Selecção / preenchimento correcto\"))","v":"Por seleccionar / preencher abaixo"},null,null,null,null,{"$f":"SUM(P13:P19)","v":1},null,null,null,null,null,null,null,null,null,null,"x","x","x","x"]
[null,null,"Mês da remuneração",null,null,null,null,null,null,null,{"$f":"K13","v":0},null,null,null,null,{"$f":"IF(ISNA(VLOOKUP($K$8&$K$13, Configuração!$E$58:$E$69, 1, FALSE)), 1, 0)","v":1},null,null,null,null,null,null,null,null,null,null,"x","x","x","x"]
[null,null,"Tipo de mês da remuneração",null,null,null,null,null,null,null,null,null,null,null,null,{"$f":"IF(ISNA(VLOOKUP($K$8&$K$13, Configuração!$E$58:$E$69, 1, FALSE)), 1, 0)","v":1},null,null,null,null,null,null,null,null,null,null,"x","x","x","x"]
[null,null,"Momento do Pagamento",null,null,null,null,null,null,null,null,null,null,null,null,null,null,null,null,null,null,null,null,null,null,null,"x","x","x","x"]
[null,null,{"$f":"IF($K$8=Configuração!$C$14, \"Pensão bruta\", \"Remuneração base bruta\")","v":"Remuneração base bruta"},null,null,null,null,null,null,null,null,null,null,1500,null,null,null,null,null,null,null,null,null,null,null,null,"x","x","x","x"]
[null,null,"Remuneração bruta após corte 2016 (aplicavél à função pública)",null,null,null,null,null,null,null,{"$f":"IF(AND(K15>=Configuração!$B$104,K15-VLOOKUP(K15,Configuração!$B$102:$J$105,2,1)*K15<=Configuração!$B$104),Configuração!$B$104+(K15-Configuração!$B$104)*(Configuração!$I$101),K15-VLOOKUP(K15,Configuração!$B$102:$J$105,8,1))","v":0},null,null,null,null,null,null,null,null,null,null,null,null,null,null,null,"x","x","x"]
[null,null,"Remuneração bruta após corte 2017 (aplicavél à função pública)",null,null,null,null,null,null,null,{"$f":"K15","v":0},null,null,null,null,null,null,null,null,null,null,null,null,null,null,null,"x","x","x"]
[null,null,"Outros itens remuneratórios (sujeitos a Segurança Social, e.g. prémio regular)",null,null,null,null,null,null,null,0,null,null,null,null,null,null,null,null,null,null,null,null,null,null,null,"x","x","x"]
[null,null,"Outros itens remuneratórios (não sujeitos a Segurança Social, e.g. gratificação extraordinária)",null,null,null,null,null,null,null,0,null,null,null,null,null,null,null,null,null,null,null,null,null,null,null,"x","x","x"]
[null,"Subsídio de Refeição",null,null,null,null,null,null,null,null,{"$f":"IF($P20>=1,\"Por seleccionar / preencher abaixo\",IF($P20>0,\"Selecção / preenchimento incorrecto\",\"Selecção / preenchimento correcto\"))","v":"Selecção / preenchimento correcto"},null,null,null,null,{"$f":"SUM(P22:P26)","v":0},null,null,null,null,null,null,null,null,null,null,"x","x","x"]
[null,null,null,null,null,null,null,null,null,null,null,null,null,null,null,null,null,null,null,null,null,null,null,null,null,null,"x","x","x"]
[null,null,"Forma de atribuição de subsídio de refeição",null,null,null,null,null,null,null,null,null,null,null,null,{"$f":"IF($K$8=Configuração!$C$14, 0, IF($K$22=Configuração!$C$71, 1, 0))","v":0},null,null,null,null,null,null,null,null,null,null,"x","x","x"]
[null,null,null,null,null,null,null,null,null,null,null,null,null,null,null,null,null,null,null,null,null,null,null,null,null,null,"x","x","x"]
[null,null,"Valor diário do subsídio de refeição"]
[]
[null,null,"Número de dias úteis mensais"]
[]
[null,"Resultado da simulação"]
[]
[null,null,null,null,null,2016,null,null,2014,null,2017,null,null,null,null,2018,null,null,null,"Variação 2017 - 2016",null,null,"Variação 2018 - 2017",null,null,null,null,"x"]
[null,null,null,null,null,null,null,null,null,null,null,null,null,null,null,null,null,null,null,null,null,null,null,null,null,null,null,"x"]
[null,"Simulador",null,null,null,"Remuneração \nSem Duodécimos","Remuneração \nCom Duodécimos","Taxas\nAplicadas",null,null,"Remuneração \nSem Duodécimos","Remuneração \nCom Duodécimos","Taxas\nAplicadas",null,null,"Remuneração \nSem Duodécimos","Remuneração \nCom Duodécimos","Taxas\nAplicadas",null,"Remuneração \nSem Duodécimos","Remuneração \nCom Duodécimos",null,"Remuneração \nSem Duodécimos","Remuneração \nCom Duodécimos",null,null,null,"x"]
[null,"Rendimento Líquido",null,null,null,{"$f":"IF(OR($K$8=Configuração!$C$14, $P$5>0), \"\", F$34-F$47)","v":""},{"$f":"IF(OR($K$8=Configuração!$C$14, $P$5>0), \"\", G$34-G$47)","v":""},null,null,null,{"$f":"IF(OR($K$8=Configuração!$C$14, $P$5>0), \"\", K$34-K$47)","v":""},{"$f":"IF(OR($K$8=Configuração!$C$14, $P$5>0), \"\", L$34-L$47)","v":""},null,null,null,{"$f":"IF(OR($K$8=Configuração!$C$14, $P$5>0), \"\", P$34-P$47)","v":""},{"$f":"IF(OR($K$8=Configuração!$C$14, $P$5>0), \"\", Q$34-Q$47)","v":""},null,null,{"$f":"IFERROR(K33-F33, \"\")","v":""},{"$f":"IFERROR(L33-G33, \"\")","v":""},null,{"$f":"IFERROR(P33-K33, \"\")","v":""},{"$f":"IFERROR(Q33-L33, \"\")","v":""},null,null,null,"x"]
[null,"Abonos",null,null,null,{"$f":"IF(OR($K$8=Configuração!$C$14, $P$5>0), \"\", SUM(F36:F40)+SUM(F42:F43)+SUM(F45:F45))","v":""},{"$f":"IF(OR($K$8=Configuração!$C$14, $P$5>0), \"\", SUM(G36:G40)+SUM(G42:G43)+SUM(G45:G45))","v":""},null,{"$f":"IF($P$5>0, \"\", SUM(I36:I40))","v":""},null,{"$f":"IF(OR($K$8=Configuração!$C$14, $P$5>0), \"\", SUM(K36:K40)+SUM(K42:K43)+SUM(K45:K45))","v":""},{"$f":"IF(OR($K$8=Configuração!$C$14, $P$5>0), \"\", SUM(L36:L40)+SUM(L42:L43)+SUM(L45:L45))","v":""},null,null,null,{"$f":"IF(OR($K$8=Configuração!$C$14, $P$5>0), \"\", SUM(P36:P40)+SUM(P42:P43)+SUM(P45:P45))","v":""},{"$f":"IF(OR($K$8=Configuração!$C$14, $P$5>0), \"\", SUM(Q36:Q40)+SUM(Q42:Q43)+SUM(Q45:Q45))","v":""},null,null,{"$f":"IFERROR(K34-F34, \"\")","v":""},{"$f":"IFERROR(L34-G34, \"\")","v":""},null,{"$f":"IFERROR(P34-K34, \"\")","v":""},{"$f":"IFERROR(Q34-L34, \"\")","v":""},null,null,null,"x"]
[null,null,"Remuneração sem Subsídios",null,null,null,null,null,null,null,null,null,null,null,null,null,null,null,null,null,null,null,null,null,null,null,null,"x"]
[null,null,null,"Remuneração base bruta",null,{"$f":"IF(OR($K$8=Configuração!$C$14,$P$5>0),\"\",IF($K$8=Configuração!$C$13,$K$16,$K$15))","v":""},{"$f":"IF(OR($K$8=Configuração!$C$14, $P$5>0), \"\", IF($K$8=Configuração!$C$13,$K$16,$K$15))","v":""},null,null,null,{"$f":"IF(OR($K$8=Configuração!$C$14, $P$5>0), \"\",IF($K$8=Configuração!$C$13,$K$17,$K$15))","v":""},{"$f":"IF(OR($K$8=Configuração!$C$14, $P$5>0), \"\", IF($K$8=Configuração!$C$13,$K$17,$K$15))","v":""},null,null,null,{"$f":"IF(OR($K$8=Configuração!$C$14, $P$5>0), \"\",IF($K$8=Configuração!$C$13,$K$17,$K$15))","v":""},{"$f":"IF(OR($K$8=Configuração!$C$14, $P$5>0), \"\", IF($K$8=Configuração!$C$13,$K$17,$K$15))","v":""},null,null,{"$f":"IFERROR(K36-F36, \"\")","v":""},"",null,{"$f":"IFERROR(P36-K36, \"\")","v":""},"",null,null,null,"x"]
[null,null,null,"Outros itens remuneratórios (sujeitos a Segurança Social)",null,{"$f":"IF(OR($K$8=Configuração!$C$14, $P$5>0), \"\", $K$18)","v":""},{"$f":"IF(OR($K$8=Configuração!$C$14, $P$5>0), \"\", $K$18)","v":""},null,null,null,{"$f":"IF(OR($K$8=Configuração!$C$14, $P$5>0), \"\", $K$18)","v":""},{"$f":"IF(OR($K$8=Configuração!$C$14, $P$5>0), \"\", $K$18)","v":""},null,null,null,{"$f":"IF(OR($K$8=Configuração!$C$14, $P$5>0), \"\", $K$18)","v":""},{"$f":"IF(OR($K$8=Configuração!$C$14, $P$5>0), \"\", $K$18)","v":""},null,null,"","",null,"","",null,null,null,"x"]
[null,null,null,"Outros itens remuneratórios (não sujeitos a Segurança Social)",null,{"$f":"IF(OR($K$8=Configuração!$C$14, $P$5>0), \"\", $K$19)","v":""},{"$f":"IF(OR($K$8=Configuração!$C$14, $P$5>0), \"\", $K$19)","v":""},null,null,null,{"$f":"IF(OR($K$8=Configuração!$C$14, $P$5>0), \"\", $K$19)","v":""},{"$f":"IF(OR($K$8=Configuração!$C$14, $P$5>0), \"\", $K$19)","v":""},null,null,null,{"$f":"IF(OR($K$8=Configuração!$C$14, $P$5>0), \"\", $K$19)","v":""},{"$f":"IF(OR($K$8=Configuração!$C$14, $P$5>0), \"\", $K$19)","v":""},null,null,"","",null,"","",null,null,null,"x"]
[null,null,null,"Subsídio de refeição (não sujeito a IRS e Segurança Social)",null,{"$f":"IF(OR($K$8=Configuração!$C$14, $P$5>0), \"\",\n       IF('Simulador Rendimento Líquido'!$K$13=Configuração!$D$61, 0,\n            IFERROR($K$26*MIN($K$24,VLOOKUP($K$22,'Fiscalidade Ano N-1'!$D$18:$E$19,2,FALSE)),\"\")))","v":""},{"$f":"IF(OR($K$8=Configuração!$C$14, $P$5>0), \"\",\n       IF('Simulador Rendimento Líquido'!$K$13=Configuração!$D$61, 0,\n            IFERROR($K$26*MIN($K$24,VLOOKUP($K$22,'Fiscalidade Ano N-1'!$D$18:$E$19,2,FALSE)),\"\")))","v":""},null,null,null,{"$f":"IF(OR($K$8=Configuração!$C$14, $P$5>0), \"\",\n       IF('Simulador Rendimento Líquido'!$K$13=Configuração!$D$61, 0,\n            IFERROR($K$26*MIN($K$24,VLOOKUP($K$22,'Fiscalidade Ano N'!$D$18:$E$19,2,FALSE)),\"\")))","v":""},{"$f":"IF(OR($K$8=Configuração!$C$14, $P$5>0), \"\",\n       IF('Simulador Rendimento Líquido'!$K$13=Configuração!$D$61, 0,\n            IFERROR($K$26*MIN($K$24,VLOOKUP($K$22,'Fiscalidade Ano N'!$D$18:$E$19,2,FALSE)),\"\")))","v":""},null,null,null,{"$f":"IF(OR($K$8=Configuração!$C$14, $P$5>0), \"\",\n       IF('Simulador Rendimento Líquido'!$K$13=Configuração!$D$61, 0,\n            IFERROR($K$26*MIN($K$24,VLOOKUP($K$22,'Fiscalidade Ano N+1'!$D$18:$E$19,2,FALSE)),\"\")))","v":""},{"$f":"IF(OR($K$8=Configuração!$C$14, $P$5>0), \"\",\n       IF('Simulador Rendimento Líquido'!$K$13=Configuração!$D$61, 0,\n            IFERROR($K$26*MIN($K$24,VLOOKUP($K$22,'Fiscalidade Ano N+1'!$D$18:$E$19,2,FALSE)),\"\")))","v":""},null,null,"","",null,"","",null,null,null,"x"]
[null,null,null,"Subsídio de refeição (sujeito a IRS e Segurança Social)",null,{"$f":"IF(OR($K$8=Configuração!$C$14, $P$5>0),  \"\",\n       IF('Simulador Rendimento Líquido'!$K$13=Configuração!$D$61, 0,\n            IFERROR($K$26*($K$24-MIN($K$24,VLOOKUP($K$22,'Fiscalidade Ano N-1'!$D$18:$E$19,2,FALSE))),\"\")))","v":""},{"$f":"IF(OR($K$8=Configuração!$C$14, $P$5>0), \"\",\n       IF('Simulador Rendimento Líquido'!$K$13=Configuração!$D$61, 0,\n            IFERROR($K$26*($K$24-MIN($K$24,VLOOKUP($K$22,'Fiscalidade Ano N-1'!$D$18:$E$19,2,FALSE))),\"\")))","v":""},null,null,null,{"$f":"IF(OR($K$8=Configuração!$C$14, $P$5>0), \"\",\n       IF('Simulador Rendimento Líquido'!$K$13=Configuração!$D$61, 0,\n            IFERROR($K$26*($K$24-MIN($K$24,VLOOKUP($K$22,'Fiscalidade Ano N'!$D$18:$E$19,2,FALSE))),\"\")))","v":""},{"$f":"IF(OR($K$8=Configuração!$C$14, $P$5>0), \"\",\n       IF('Simulador Rendimento Líquido'!$K$13=Configuração!$D$61, 0,\n            IFERROR($K$26*($K$24-MIN($K$24,VLOOKUP($K$22,'Fiscalidade Ano N'!$D$18:$E$19,2,FALSE))),\"\")))","v":""},null,null,null,{"$f":"IF(OR($K$8=Configuração!$C$14, $P$5>0), \"\",\n       IF('Simulador Rendimento Líquido'!$K$13=Configuração!$D$61, 0,\n            IFERROR($K$26*($K$24-MIN($K$24,VLOOKUP($K$22,'Fiscalidade Ano N+1'!$D$18:$E$19,2,FALSE))),\"\")))","v":""},{"$f":"IF(OR($K$8=Configuração!$C$14, $P$5>0), \"\",\n       IF('Simulador Rendimento Líquido'!$K$13=Configuração!$D$61, 0,\n            IFERROR($K$26*($K$24-MIN($K$24,VLOOKUP($K$22,'Fiscalidade Ano N+1'!$D$18:$E$19,2,FALSE))),\"\")))","v":""},null,null,"","",null,"","",null,null,null,"x"]
{"$rows_left_out":40}
{"sheet":"Configuração","index":1,"n_rows":105,"n_cols":10,"rows_kept":105,"cut":false,"hidden":true,"merged":[]}
[]
[null,"Simulador Rendimento Líquido em 2018"]
[]
[null,"Configuração de parâmetros",null,null,null,"Desenvolvido por"]
[]
[null,"Região Geográfica","[ Seleccione Uma Opção ]"]
[null,"Região Geográfica","Continente"]
[null,"Região Geográfica","Região Autónoma dos Açores"]
[null,"Região Geográfica","Região Autónoma da Madeira"]
[]
[null,"Sector","[ Seleccione Uma Opção ]"]
[null,"Sector","Trabalho Dependente - Privado"]
[null,"Sector","Trabalho Dependente - Função Pública"]
[null,"Sector","Pensionistas - Privado"]
[]
[null,"Situação pessoal","[ Seleccione Uma Opção ]","[ Seleccione Uma Opção ]"]
[null,"Situação pessoal",{"$f":"$C$12","v":"Trabalho Dependente - Privado"},"[ Seleccione Uma Opção ]"]
[null,"Situação pessoal",{"$f":"$C$12","v":"Trabalho Dependente - Privado"},"Não Casado",{"$f":"C18&D18","v":"Trabalho Dependente - PrivadoNão Casado"}]
[null,"Situação pessoal","Trabalho Dependente - Privado","Casado (Um Titular)","Trabalho Dependente - PrivadoCasado (Um Titular)"]
[null,"Situação pessoal","Trabalho Dependente - Privado","Casado (Dois Titulares)","Trabalho Dependente - PrivadoCasado (Dois Titulares)"]
[null,"Situação pessoal","Trabalho Dependente - Privado","Deficiente - Não Casado","Trabalho Dependente - PrivadoDeficiente - Não Casado"]
[null,"Situação pessoal","Trabalho Dependente - Privado","Deficiente - Casado (Um Titular)","Trabalho Dependente - PrivadoDeficiente - Casado (Um Titular)"]
[null,"Situação pessoal","Trabalho Dependente - Privado","Deficiente - Casado (Dois Titulares)","Trabalho Dependente - PrivadoDeficiente - Casado (Dois Titulares)"]
[null,"Situação pessoal",{"$f":"$C$13","v":"Trabalho Dependente - Função Pública"},"[ Seleccione Uma Opção ]"]
[null,"Situação pessoal",{"$f":"$C$13","v":"Trabalho Dependente - Função Pública"},"Não Casado","Trabalho Dependente - Função PúblicaNão Casado"]
[null,"Situação pessoal","Trabalho Dependente - Função Pública","Casado (Um Titular)","Trabalho Dependente - Função PúblicaCasado (Um Titular)"]
[null,"Situação pessoal","Trabalho Dependente - Função Pública","Casado (Dois Titulares)","Trabalho Dependente - Função PúblicaCasado (Dois Titulares)"]
[null,"Situação pessoal","Trabalho Dependente - Função Pública","Deficiente - Não Casado","Trabalho Dependente - Função PúblicaDeficiente - Não Casado"]
[null,"Situação pessoal","Trabalho Dependente - Função Pública","Deficiente - Casado (Um Titular)","Trabalho Dependente - Função PúblicaDeficiente - Casado (Um Titular)"]
[null,"Situação pessoal","Trabalho Dependente - Função Pública","Deficiente - Casado (Dois Titulares)","Trabalho Dependente - Função PúblicaDeficiente - Casado (Dois Titulares)"]
[null,"Situação pessoal",{"$f":"$C$14","v":"Pensionistas - Privado"},"[ Seleccione Uma Opção ]"]
[null,"Situação pessoal",{"$f":"$C$14","v":"Pensionistas - Privado"},"Não Casado","Pensionistas - PrivadoNão Casado"]
[null,"Situação pessoal","Pensionistas - Privado","Casado (Um Titular)","Pensionistas - PrivadoCasado (Um Titular)"]
[null,"Situação pessoal","Pensionistas - Privado","Casado (Dois Titulares)","Pensionistas - PrivadoCasado (Dois Titulares)"]
[null,"Situação pessoal","Pensionistas - Privado","Deficiente - Não Casado","Pensionistas - PrivadoDeficiente - Não Casado"]
[null,"Situação pessoal","Pensionistas - Privado","Deficiente - Casado (Um Titular)","Pensionistas - PrivadoDeficiente - Casado (Um Titular)"]
[null,"Situação pessoal","Pensionistas - Privado","Deficiente - Casado (Dois Titulares)","Pensionistas - PrivadoDeficiente - Casado (Dois Titulares)"]
[null,"Situação pessoal","Pensionistas - Privado","Deficiente Forças Armadas - Não Casado","Pensionistas - PrivadoDeficiente Forças Armadas - Não Casado"]
[null,"Situação pessoal","Pensionistas - Privado","Deficiente Forças Armadas - Casado (Um Titular)","Pensionistas - PrivadoDeficiente Forças Armadas - Casado (Um Titular)"]
[null,"Situação pessoal","Pensionistas - Privado","Deficiente Forças Armadas - Casado (Dois Titulares)","Pensionistas - PrivadoDeficiente Forças Armadas - Casado (Dois Titulares)"]
{"$rows_left_out":66}
{"sheet":"Fiscalidade Ano N-1","index":2,"n_rows":509,"n_cols":11,"rows_kept":509,"cut":false,"hidden":true,"merged":[[5,1,5,4],[35,5,35,10],[15,1,15,4],[10,1,10,4],[7,3,7,4],[12,3,12,4],[13,3,13,4],[35,3,35,4],[7,1,7,2],[12,1,12,2],[13,1,13,2],[17,1,17,2],[18,1,18,2],[22,1,22,2],[22,3,22,6],[8,3,8,4]]}
[]
[null,"Simulador Rendimento Líquido em 2016"]
[]
[null,"Enquadramento Fiscal Ano N (2016)",null,null,null,null,null,null,"Desenvolvido por"]
[]
[null,"Enquadramento Fiscal - Segurança Social"]
[]
[null,"Taxa Social Única",null,0.11]
[null,"ADSE",null,3.5000000000000003E-2]
[]
[null,"Enquadramento Fiscal - Sobretaxa IRS"]
[]
[null,"Taxa Sobretaxa IRS",null,3.5000000000000003E-2]
[null,"Limite Isenção Sobretaxa IRS (Retribuição Mínima Garantida)",null,530]
[]
[null,"Enquadramento Fiscal - Sobretaxa IRS"]
[]
[null,"Limite Isenção Subsídio de Refeição",null,"Numerário",4.2699999999999996]
[null,"Limite Isenção Subsídio de Refeição",null,"Vale de Refeição",6.83]
[]
[null,"Sobretaxa"]
[]
[null,"Tabela aplicável a sujeitos passivos não casados e casados 2 titulares",null,"Tabela aplicável a sujeitos passivos casados (1 titular)"]
[null,"Limite inferior","Taxa","Limite inferior","Taxa"]
[null,0,0,0,0]
[null,801,0.01,1205,0.01]
[null,1683,1.7500000000000002E-2,2888,1.7500000000000002E-2]
[null,3054,0.03,6280,0.03]
[null,5786,3.5000000000000003E-2,10282,3.5000000000000003E-2]
[null,null,0]
[]
[]
[]
[null,"Tabelas Retenção Fonte"]
[]
[null,null,null,"Remuneração Mensal ",null,"Número Dependentes"]
[null,"Região Geográfica","Tabela Retenção Fonte","De","Até",0,1,2,3,4,"5 ou Mais"]
[null,"Continente","TABELA I - TRABALHO DEPENDENTE - NÃO CASADO",{"$f":"IF(ISNUMBER(E37), E37, 0)","v":0},610,0,0,0,0,0,0]
[null,"Continente","TABELA I - TRABALHO DEPENDENTE - NÃO CASADO",{"$f":"IF(ISNUMBER(E38), E38, 0)","v":610},618,1.7999999999999999E-2,0,0,0,0,0]
[null,"Continente","TABELA I - TRABALHO DEPENDENTE - NÃO CASADO",618,640,0.05,0,0,0,0,0]
{"$rows_left_out":470}
{"sheet":"Fiscalidade Ano N","index":3,"n_rows":509,"n_cols":13,"rows_kept":509,"cut":false,"hidden":true,"merged":[[5,1,5,4],[7,1,7,2],[7,3,7,4],[10,1,10,4],[12,1,12,2],[12,3,12,4],[8,3,8,4],[22,5,22,8],[22,1,22,4],[35,5,35,10],[13,1,13,2],[13,3,13,4],[15,1,15,4],[17,1,17,2],[18,1,18,2],[35,3,35,4],[29,1,29,2],[30,1,30,2],[31,1,31,2]]}
[]
[null,"Simulador Rendimento Líquido em 2017"]
[]
[null,"Enquadramento Fiscal Ano N-1 (2016)",null,null,null,null,null,null,"Desenvolvido por"]
[]
[null,"Enquadramento Fiscal - Segurança Social"]
[]
[null,"Taxa Social Única",null,0.11,null,"não consideramos a redução da TSU"]
[null,"ADSE",null,3.5000000000000003E-2]
[]
[null,"Enquadramento Fiscal - Sobretaxa IRS"]
[]
[null,"Taxa Sobretaxa IRS",null,0]
[null,"Limite Isenção Sobretaxa IRS (Retribuição Mínima Garantida)",null,557]
[]
[null,"Enquadramento Fiscal - Sobretaxa IRS"]
[]
[null,"Limite Isenção Subsídio de Refeição",null,"Numerário",4.5199999999999996]
[null,"Limite Isenção Subsídio de Refeição",null,"Vale de Refeição",7.23]
[]
[null,"Sobretaxa"]
[]
[null,"Tabela aplicável a sujeitos passivos não casados e casados 2 titulares",null,null,null,"Tabela aplicável a sujeitos passivos casados (1 titular)"]
[null,"Limite inferior",42916,43069,43100,"Limite inferior",42916,43069,43100,null,null,null,"Dezembro"]
[null,0,0,0,0,0,0,0,0,null,null,null,0]
[null,1705.01,1.7500000000000002E-2,0,0,2925.01,1.7500000000000002E-2,0,0,null,null,null,0]
[null,3094.01,0.03,0.03,0,6361.01,0.03,0.03,0,null,null,null,0]
[null,5862.01,3.5000000000000003E-2,3.5000000000000003E-2,0,10416.01,3.5000000000000003E-2,3.5000000000000003E-2,0,null,null,null,0]
[null,null,null,null,null,null,null,null,null,null,null,null,0]
[]
[]
[]
[]
[null,"Tabelas Retenção Fonte"]
[]
[null,null,null,"Remuneração Mensal ",null,"Número Dependentes"]
[null,"Região Geográfica","Tabela Retenção Fonte","De","Até",0,1,2,3,4,"5 ou Mais"]
[null,"Continente","TABELA I - TRABALHO DEPENDENTE - NÃO CASADO",{"$f":"IF(ISNUMBER(E37), E37, 0)","v":0},615,0,0,0,0,0,0]
[null,"Continente","TABELA I - TRABALHO DEPENDENTE - NÃO CASADO",{"$f":"IF(ISNUMBER(E38), E38, 0)","v":615},623,1.7999999999999999E-2,0,0,0,0,0]
[null,"Continente","TABELA I - TRABALHO DEPENDENTE - NÃO CASADO",623,645,0.05,0,0,0,0,0]
{"$rows_left_out":470}
{"sheet":"Fiscalidade Ano N+1","index":4,"n_rows":507,"n_cols":13,"rows_kept":507,"cut":false,"hidden":true,"merged":[[12,1,12,2],[12,3,12,4],[5,1,5,4],[7,1,7,2],[7,3,7,4],[8,3,8,4],[10,1,10,4],[13,1,13,2],[13,3,13,4],[15,1,15,4],[17,1,17,2],[18,1,18,2],[22,5,22,8],[29,1,29,2],[30,1,30,2],[31,1,31,2],[35,3,35,4],[35,5,35,10],[22,1,22,4]]}
[]
[null,"Simulador Rendimento Líquido em 2018"]
[]
[null,"Enquadramento Fiscal Ano N (2017)",null,null,null,null,null,null,"Desenvolvido por"]
[]
[null,"Enquadramento Fiscal - Segurança Social"]
[]
[null,"Taxa Social Única",null,0.11,null,"não consideramos a redução da TSU"]
[null,"ADSE",null,3.5000000000000003E-2]
[]
[null,"Enquadramento Fiscal - Sobretaxa IRS"]
[]
[null,"Taxa Sobretaxa IRS",null,0]
[null,"Limite Isenção Sobretaxa IRS (Retribuição Mínima Garantida)",null,580]
[]
[null,"Enquadramento Fiscal - Sobretaxa IRS"]
[]
[null,"Limite Isenção Subsídio de Refeição",null,"Numerário",4.7699999999999996]
[null,"Limite Isenção Subsídio de Refeição",null,"Vale de Refeição",7.63]
[]
[null,"Sobretaxa"]
[]
[null,"Tabela aplicável a sujeitos passivos não casados e casados 2 titulares",null,null,null,"Tabela aplicável a sujeitos passivos casados (1 titular)"]
[null,"Limite inferior",42916,43069,43100,"Limite inferior",42916,43069,43100,null,null,null,"Dezembro"]
[null,0,0,0,0,0,0,0,0,null,null,null,0]
[null,1705.01,1.7500000000000002E-2,0,0,2925.01,1.7500000000000002E-2,0,0,null,null,null,0]
[null,3094.01,0.03,0.03,0,6361.01,0.03,0.03,0,null,null,null,0]
[null,5862.01,3.5000000000000003E-2,3.5000000000000003E-2,0,10416.01,3.5000000000000003E-2,3.5000000000000003E-2,0,null,null,null,0]
[null,null,null,null,null,null,null,null,null,null,null,null,0]
[]
[]
[]
[]
[null,"Tabelas Retenção Fonte"]
[]
[null,null,null,"Remuneração Mensal ",null,"Número Dependentes"]
[null,"Região Geográfica","Tabela Retenção Fonte","De","Até",0,1,2,3,4,"5 ou Mais"]
[null,"Continente","TABELA I - TRABALHO DEPENDENTE - NÃO CASADO",{"$f":"IF(ISNUMBER(E37), E37, 0)","v":0},632,0,0,0,0,0,0]
[null,"Continente","TABELA I - TRABALHO DEPENDENTE - NÃO CASADO",{"$f":"IF(ISNUMBER(E38), E38, 0)","v":632},645,0.03,0,0,0,0,0]
[null,"Continente","TABELA I - TRABALHO DEPENDENTE - NÃO CASADO",645,683,5.7000000000000002E-2,1.2999999999999999E-2,0,0,0,0]
{"$rows_left_out":467}